Information card for entry 4344403
Common name | england6 |
Formula | C23 H14 Au F17 N4 P2 |
Calculated formula | C23 H14 Au F17 N4 P2 |
SMILES | [Au]12([n]3ccccc3c3cccc([n]13)c1cccc[n]21)c1c(F)c(F)c(F)c(F)c1F.[P](F)(F)(F)(F)(F)[F-].[P](F)(F)(F)(F)(F)[F-].N#CC |
Title of publication | Synthesis, Photochemical, and Redox Properties of Gold(I) and Gold(III) Pincer Complexes Incorporating a 2,2':6',2″-Terpyridine Ligand Framework. |
Authors of publication | Gimeno, M Concepción; López-de-Luzuriaga, José M; Manso, Elena; Monge, Miguel; Olmos, M. Elena; Rodríguez-Castillo, María; Tena, María-Teresa; Day, David P.; Lawrence, Elliot J.; Wildgoose, Gregory G. |
Journal of publication | Inorganic chemistry |
Year of publication | 2015 |
Journal volume | 54 |
Journal issue | 22 |
Pages of publication | 10667 - 10677 |
a | 16.098 ± 0.0003 Å |
b | 10.1139 ± 0.0003 Å |
c | 17.2996 ± 0.0005 Å |
α | 90° |
β | 93.19 ± 0.002° |
γ | 90° |
Cell volume | 2812.25 ± 0.13 Å3 |
Cell temperature | 173 ± 1 K |
Ambient diffraction temperature | 173 ± 1 K |
Number of distinct elements | 6 |
Space group number | 14 |
Hermann-Mauguin space group symbol | P 1 21/c 1 |
Hall space group symbol | -P 2ybc |
Residual factor for all reflections | 0.033 |
Residual factor for significantly intense reflections | 0.0263 |
Weighted residual factors for significantly intense reflections | 0.0651 |
Weighted residual factors for all reflections included in the refinement | 0.0679 |
Goodness-of-fit parameter for all reflections included in the refinement | 1.029 |
Diffraction radiation probe | x-ray |
Diffraction radiation wavelength | 0.71073 Å |
Diffraction radiation type | MoKα |