Information card for entry 4344416
Formula | C24 H23 Cl3 Co N2 O4 S2 |
Calculated formula | C24 H23 Cl3 Co N2 O4 S2 |
Title of publication | Crystal Structures, Magnetic Properties, and Electrochemical Properties of Coordination Polymers Based on the Tetra(4-pyridyl)-tetrathiafulvalene Ligand. |
Authors of publication | Wang, Hai-Ying; Wu, Yue; Leong, Chanel F.; D'Alessandro, Deanna M; Zuo, Jing-Lin |
Journal of publication | Inorganic chemistry |
Year of publication | 2015 |
Journal volume | 54 |
Journal issue | 22 |
Pages of publication | 10766 - 10775 |
a | 7.6741 ± 0.0002 Å |
b | 11.7196 ± 0.0005 Å |
c | 15.9558 ± 0.0007 Å |
α | 85.945 ± 0.004° |
β | 81.135 ± 0.003° |
γ | 86.628 ± 0.003° |
Cell volume | 1412.66 ± 0.09 Å3 |
Cell temperature | 100.01 ± 0.1 K |
Ambient diffraction temperature | 100.01 ± 0.1 K |
Number of distinct elements | 7 |
Space group number | 2 |
Hermann-Mauguin space group symbol | P -1 |
Hall space group symbol | -P 1 |
Residual factor for all reflections | 0.062 |
Residual factor for significantly intense reflections | 0.0456 |
Weighted residual factors for significantly intense reflections | 0.1075 |
Weighted residual factors for all reflections included in the refinement | 0.1186 |
Goodness-of-fit parameter for all reflections included in the refinement | 1.04 |
Diffraction radiation probe | x-ray |
Diffraction radiation wavelength | 1.54184 Å |
Diffraction radiation type | CuKα |