Information card for entry 4344418
Formula | C24 H25 Cl3 Cu2 N3 O8.5 S2 |
Calculated formula | C24 H25 Cl3 Cu2 N3 O8.5 S2 |
Title of publication | Crystal Structures, Magnetic Properties, and Electrochemical Properties of Coordination Polymers Based on the Tetra(4-pyridyl)-tetrathiafulvalene Ligand. |
Authors of publication | Wang, Hai-Ying; Wu, Yue; Leong, Chanel F.; D'Alessandro, Deanna M; Zuo, Jing-Lin |
Journal of publication | Inorganic chemistry |
Year of publication | 2015 |
Journal volume | 54 |
Journal issue | 22 |
Pages of publication | 10766 - 10775 |
a | 7.2429 ± 0.0002 Å |
b | 20.6964 ± 0.0006 Å |
c | 24.9676 ± 0.0006 Å |
α | 90° |
β | 91.705 ± 0.002° |
γ | 90° |
Cell volume | 3741.04 ± 0.17 Å3 |
Cell temperature | 100 ± 0.1 K |
Ambient diffraction temperature | 100 ± 0.1 K |
Number of distinct elements | 7 |
Space group number | 14 |
Hermann-Mauguin space group symbol | P 1 21/c 1 |
Hall space group symbol | -P 2ybc |
Residual factor for all reflections | 0.0839 |
Residual factor for significantly intense reflections | 0.0721 |
Weighted residual factors for significantly intense reflections | 0.2107 |
Weighted residual factors for all reflections included in the refinement | 0.2225 |
Goodness-of-fit parameter for all reflections included in the refinement | 1.069 |
Diffraction radiation probe | x-ray |
Diffraction radiation wavelength | 1.54184 Å |
Diffraction radiation type | CuKα |