Information card for entry 4344427
Chemical name | Bis(cyano-κC)[2-(isoquinolin-1-yl-κN)phenyl-κC^1^]gold(iii) |
Formula | C17 H10 Au N3 |
Calculated formula | C17 H10 Au N3 |
SMILES | [Au]1(c2c(c3c4c(cc[n]13)cccc4)cccc2)(C#N)C#N |
Title of publication | Monocyclometalated Gold(III) Complexes Bearing π-Accepting Cyanide Ligands: Syntheses, Structural, Photophysical, and Electrochemical Investigations. |
Authors of publication | Szentkuti, Alexander; Garg, Jai Anand; Blacque, Olivier; Venkatesan, Koushik |
Journal of publication | Inorganic chemistry |
Year of publication | 2015 |
Journal volume | 54 |
Journal issue | 22 |
Pages of publication | 10748 - 10760 |
a | 13.264 ± 0.002 Å |
b | 18.8066 ± 0.0005 Å |
c | 20.287 ± 0.003 Å |
α | 90° |
β | 147.07 ± 0.04° |
γ | 90° |
Cell volume | 2751 ± 3 Å3 |
Cell temperature | 183 ± 2 K |
Ambient diffraction temperature | 183 ± 2 K |
Number of distinct elements | 4 |
Space group number | 14 |
Hermann-Mauguin space group symbol | P 1 21/n 1 |
Hall space group symbol | -P 2yn |
Residual factor for all reflections | 0.0509 |
Residual factor for significantly intense reflections | 0.0335 |
Weighted residual factors for significantly intense reflections | 0.075 |
Weighted residual factors for all reflections included in the refinement | 0.0898 |
Goodness-of-fit parameter for all reflections included in the refinement | 1.085 |
Diffraction radiation wavelength | 0.7107 Å |
Diffraction radiation type | MoKα |