Information card for entry 4344430
Formula | C31 H34 Cl8 Ir N3 |
Calculated formula | C31 H34 Cl8 Ir N3 |
Title of publication | Ir(III)-Based Phosphors with Bipyrazolate Ancillaries; Rational Design, Photophysics, and Applications in Organic Light-Emitting Diodes. |
Authors of publication | Liao, Jia-Ling; Chi, Yun; Sie, Zong-Ting; Ku, Chia-Hao; Chang, Chih-Hao; Fox, Mark A.; Low, Paul J.; Tseng, Meu-Rurng; Lee, Gene-Hsiang |
Journal of publication | Inorganic chemistry |
Year of publication | 2015 |
Journal volume | 54 |
Journal issue | 22 |
Pages of publication | 10811 - 10821 |
a | 22.8121 ± 0.001 Å |
b | 11.8525 ± 0.0005 Å |
c | 27.9109 ± 0.0012 Å |
α | 90° |
β | 103.038 ± 0.001° |
γ | 90° |
Cell volume | 7352 ± 0.5 Å3 |
Cell temperature | 200 ± 2 K |
Ambient diffraction temperature | 200 ± 2 K |
Number of distinct elements | 5 |
Space group number | 15 |
Hermann-Mauguin space group symbol | C 1 2/c 1 |
Hall space group symbol | -C 2yc |
Residual factor for all reflections | 0.0704 |
Residual factor for significantly intense reflections | 0.0524 |
Weighted residual factors for significantly intense reflections | 0.1169 |
Weighted residual factors for all reflections included in the refinement | 0.1248 |
Goodness-of-fit parameter for all reflections included in the refinement | 1.06 |
Diffraction radiation wavelength | 0.71073 Å |
Diffraction radiation type | MoKα |