Information card for entry 4344433
Formula | C46 H38 B Br Cl2 F2 N2 P2 Pt |
Calculated formula | C46 H38 B Br Cl2 F2 N2 P2 Pt |
Title of publication | Ligand Based Dual Fluorescence and Phosphorescence Emission from BODIPY Platinum Complexes and Its Application to Ratiometric Singlet Oxygen Detection. |
Authors of publication | Geist, Fabian; Jackel, Andrej; Winter, Rainer F. |
Journal of publication | Inorganic chemistry |
Year of publication | 2015 |
Journal volume | 54 |
Journal issue | 22 |
Pages of publication | 10946 - 10957 |
a | 24.4348 ± 0.001 Å |
b | 10.9021 ± 0.0003 Å |
c | 31.9717 ± 0.0013 Å |
α | 90° |
β | 100.722 ± 0.003° |
γ | 90° |
Cell volume | 8368.3 ± 0.5 Å3 |
Cell temperature | 293 ± 2 K |
Ambient diffraction temperature | 293 ± 2 K |
Number of distinct elements | 9 |
Space group number | 15 |
Hermann-Mauguin space group symbol | C 1 2/c 1 |
Hall space group symbol | -C 2yc |
Residual factor for all reflections | 0.0495 |
Residual factor for significantly intense reflections | 0.0397 |
Weighted residual factors for significantly intense reflections | 0.0758 |
Weighted residual factors for all reflections included in the refinement | 0.0783 |
Goodness-of-fit parameter for all reflections included in the refinement | 1.13 |
Diffraction radiation wavelength | 0.71073 Å |
Diffraction radiation type | MoKα |