Information card for entry 4344443
Formula | C36 H21 Eu F18 N6 O6 |
Calculated formula | C36 H21 Eu F18 N6 O6 |
SMILES | c12ccccc1c[n]([nH]2)[Eu]123([n]4cc5ccccc5[nH]4)([n]4cc5ccccc5[nH]4)(OC(=CC(C(F)(F)F)=[O]1)C(F)(F)F)(OC(=CC(C(F)(F)F)=[O]2)C(F)(F)F)OC(=CC(C(F)(F)F)=[O]3)C(F)(F)F |
Title of publication | Efficient Layers of Emitting Ternary Lanthanide Complexes for Fabricating Red, Green, and Yellow OLEDs. |
Authors of publication | Ahmed, Zubair; Iftikhar, Khalid |
Journal of publication | Inorganic chemistry |
Year of publication | 2015 |
Journal volume | 54 |
Journal issue | 23 |
Pages of publication | 11209 - 11225 |
a | 11.9959 ± 0.0017 Å |
b | 18.959 ± 0.003 Å |
c | 19.39 ± 0.003 Å |
α | 90° |
β | 103.2 ± 0.007° |
γ | 90° |
Cell volume | 4293.4 ± 1.1 Å3 |
Cell temperature | 298 ± 2 K |
Ambient diffraction temperature | 298 ± 2 K |
Number of distinct elements | 6 |
Space group number | 14 |
Hermann-Mauguin space group symbol | P 1 21/n 1 |
Hall space group symbol | -P 2yn |
Residual factor for all reflections | 0.0541 |
Residual factor for significantly intense reflections | 0.0419 |
Weighted residual factors for significantly intense reflections | 0.1182 |
Weighted residual factors for all reflections included in the refinement | 0.131 |
Goodness-of-fit parameter for all reflections included in the refinement | 1.098 |
Diffraction radiation wavelength | 0.71073 Å |
Diffraction radiation type | MoKα |