Information card for entry 4344449
Formula | C25 H39 Cl P2 Pd Si |
Calculated formula | C25 H39 Cl P2 Pd Si |
SMILES | [Pd]12(Cl)[P](c3ccccc3[Si]2(C)c2ccccc2[P]1(C(C)C)C(C)C)(C(C)C)C(C)C |
Title of publication | Understanding the Solution and Solid-State Structures of Pd and Pt PSiP Pincer-Supported Hydrides. |
Authors of publication | Suh, Hee-Won; Balcells, David; Edwards, Alison J.; Guard, Louise M.; Hazari, Nilay; Mader, Elizabeth A.; Mercado, Brandon Q.; Repisky, Michal |
Journal of publication | Inorganic chemistry |
Year of publication | 2015 |
Journal volume | 54 |
Journal issue | 23 |
Pages of publication | 11411 - 11422 |
a | 12.2218 ± 0.0003 Å |
b | 13.9074 ± 0.0004 Å |
c | 16.238 ± 0.0011 Å |
α | 90° |
β | 102.87 ± 0.007° |
γ | 90° |
Cell volume | 2690.7 ± 0.2 Å3 |
Cell temperature | 93 ± 2 K |
Ambient diffraction temperature | 93 ± 2 K |
Number of distinct elements | 6 |
Space group number | 14 |
Hermann-Mauguin space group symbol | P 1 21/n 1 |
Hall space group symbol | -P 2yn |
Residual factor for all reflections | 0.0417 |
Residual factor for significantly intense reflections | 0.0382 |
Weighted residual factors for significantly intense reflections | 0.0675 |
Weighted residual factors for all reflections included in the refinement | 0.0686 |
Goodness-of-fit parameter for all reflections included in the refinement | 1.262 |
Diffraction radiation wavelength | 0.71075 Å |
Diffraction radiation type | MoKα |