Information card for entry 4344451
Formula | C79 H124 P4 Pt2 Si2 |
Calculated formula | C79 H123.9 P4 Pt2 Si2 |
Title of publication | Understanding the Solution and Solid-State Structures of Pd and Pt PSiP Pincer-Supported Hydrides. |
Authors of publication | Suh, Hee-Won; Balcells, David; Edwards, Alison J.; Guard, Louise M.; Hazari, Nilay; Mader, Elizabeth A.; Mercado, Brandon Q.; Repisky, Michal |
Journal of publication | Inorganic chemistry |
Year of publication | 2015 |
Journal volume | 54 |
Journal issue | 23 |
Pages of publication | 11411 - 11422 |
a | 24.4262 ± 0.0005 Å |
b | 16.3 ± 0.0003 Å |
c | 39.968 ± 0.003 Å |
α | 90° |
β | 105.394 ± 0.007° |
γ | 90° |
Cell volume | 15342.2 ± 1.3 Å3 |
Cell temperature | 150 K |
Ambient diffraction temperature | 150 K |
Number of distinct elements | 5 |
Space group number | 15 |
Hermann-Mauguin space group symbol | C 1 2/c 1 |
Hall space group symbol | -C 2yc |
Residual factor for all reflections | 0.2905 |
Residual factor for significantly intense reflections | 0.1695 |
Weighted residual factors for all reflections | 0.2949 |
Weighted residual factors for significantly intense reflections | 0.1356 |
Weighted residual factors for all reflections included in the refinement | 0.1149 |
Goodness-of-fit parameter for all reflections included in the refinement | 1.1458 |
Diffraction radiation probe | neutron |
Diffraction radiation wavelength | 0.85 Å |
Diffraction radiation type | neutron |