Information card for entry 4344455
Formula | C172 H265 Cl7 Dy24 N48 O195 Zn6 |
Calculated formula | C172 H160 Cl7 Dy24 N48 O195 Zn6 |
Title of publication | Nanoscale {Ln(III)24Zn(II)6} Triangular Metalloring with Magnetic Refrigerant, Slow Magnetic Relaxation, and Fluorescent Properties. |
Authors of publication | Zhang, Li; Zhao, Lang; Zhang, Peng; Wang, Chao; Yuan, Sen-Wen; Tang, Jinkui |
Journal of publication | Inorganic chemistry |
Year of publication | 2015 |
Journal volume | 54 |
Journal issue | 23 |
Pages of publication | 11535 - 11541 |
a | 47.586 ± 0.003 Å |
b | 42.449 ± 0.003 Å |
c | 24.6782 ± 0.0017 Å |
α | 90° |
β | 113.173 ± 0.001° |
γ | 90° |
Cell volume | 45828 ± 5 Å3 |
Cell temperature | 186 ± 2 K |
Ambient diffraction temperature | 186 ± 2 K |
Number of distinct elements | 7 |
Space group number | 15 |
Hermann-Mauguin space group symbol | C 1 2/c 1 |
Hall space group symbol | -C 2yc |
Residual factor for all reflections | 0.1307 |
Residual factor for significantly intense reflections | 0.0691 |
Weighted residual factors for significantly intense reflections | 0.2079 |
Weighted residual factors for all reflections included in the refinement | 0.2445 |
Goodness-of-fit parameter for all reflections included in the refinement | 1.093 |
Diffraction radiation wavelength | 0.71073 Å |
Diffraction radiation type | MoKα |