Information card for entry 4345143
Chemical name | [Chlorido(1-(4''-methoxybenzyl)-4-(2'-kC)-phenyl-(3-kN)-1,2,3-triazolato) (n6-p-cymene)ruthenium(II)] |
Formula | C26 H28 Cl N3 O Ru |
Calculated formula | C26 H28 Cl N3 O Ru |
SMILES | [Ru]123456(Cl)([n]7nn(cc7c7c1cccc7)Cc1ccc(OC)cc1)[c]1([cH]2[cH]3[c]4([cH]5[cH]61)C)C(C)C |
Title of publication | Introducing the 4-Phenyl-1,2,3-Triazole Moiety as a Versatile Scaffold for the Development of Cytotoxic Ruthenium(II) and Osmium(II) Arene Cyclometalates. |
Authors of publication | Riedl, Christoph A.; Flocke, Lea S.; Hejl, Michaela; Roller, Alexander; Klose, Matthias H. M.; Jakupec, Michael A.; Kandioller, Wolfgang; Keppler, Bernhard K. |
Journal of publication | Inorganic chemistry |
Year of publication | 2017 |
Journal volume | 56 |
Journal issue | 1 |
Pages of publication | 528 - 541 |
a | 11.9911 ± 0.0004 Å |
b | 13.916 ± 0.0004 Å |
c | 15.2047 ± 0.0005 Å |
α | 72.6541 ± 0.0012° |
β | 78.1325 ± 0.0012° |
γ | 78.1211 ± 0.001° |
Cell volume | 2341.49 ± 0.13 Å3 |
Cell temperature | 100 K |
Ambient diffraction temperature | 100 K |
Number of distinct elements | 6 |
Space group number | 2 |
Hermann-Mauguin space group symbol | P -1 |
Hall space group symbol | -P 1 |
Residual factor for all reflections | 0.0835 |
Residual factor for significantly intense reflections | 0.0421 |
Weighted residual factors for significantly intense reflections | 0.0704 |
Weighted residual factors for all reflections included in the refinement | 0.0799 |
Goodness-of-fit parameter for all reflections included in the refinement | 1.005 |
Diffraction radiation wavelength | 0.71073 Å |
Diffraction radiation type | MoKα |