Information card for entry 4346018
Formula | C43 H51 N4 O24 Zn2 |
Calculated formula | C43 H33 N4 O22.25 Zn2 |
Title of publication | Introduction of lewis acidic and redox-active sites into a porous framework for ammonia capture with visual color response. |
Authors of publication | Tan, Bin; Chen, Cheng; Cai, Li-Xuan; Zhang, Ya-Jun; Huang, Xiao-Ying; Zhang, Jie |
Journal of publication | Inorganic chemistry |
Year of publication | 2015 |
Journal volume | 54 |
Journal issue | 7 |
Pages of publication | 3456 - 3461 |
a | 11.1231 ± 0.0001 Å |
b | 29.0062 ± 0.0004 Å |
c | 14.7756 ± 0.0002 Å |
α | 90° |
β | 91.543 ± 0.001° |
γ | 90° |
Cell volume | 4765.45 ± 0.1 Å3 |
Cell temperature | 100 ± 2 K |
Ambient diffraction temperature | 100 ± 2 K |
Number of distinct elements | 5 |
Space group number | 14 |
Hermann-Mauguin space group symbol | P 1 21/n 1 |
Hall space group symbol | -P 2yn |
Residual factor for all reflections | 0.0528 |
Residual factor for significantly intense reflections | 0.0464 |
Weighted residual factors for significantly intense reflections | 0.1327 |
Weighted residual factors for all reflections included in the refinement | 0.1381 |
Goodness-of-fit parameter for all reflections included in the refinement | 1.007 |
Diffraction radiation wavelength | 1.54178 Å |
Diffraction radiation type | CuKα |