Information card for entry 4346029
Formula | C28 H56 Er48 O244 S28 |
Calculated formula | C28 H56 Er48 O241.28 S28 |
Title of publication | Erbium hydroxide ethanedisulfonate: a cationic layered material with organic anion exchange capability. |
Authors of publication | Sergo, Kevin M.; Han, Cari S.; Bresler, Marc R.; Citrak, Susan C.; Abdollahian, Yashar; Fei, Honghan; Oliver, Scott R. J. |
Journal of publication | Inorganic chemistry |
Year of publication | 2015 |
Journal volume | 54 |
Journal issue | 8 |
Pages of publication | 3883 - 3888 |
a | 14.0296 ± 0.0004 Å |
b | 23.8117 ± 0.0007 Å |
c | 18.3099 ± 0.0005 Å |
α | 90° |
β | 100.04° |
γ | 90° |
Cell volume | 6023.1 ± 0.3 Å3 |
Cell temperature | 296 ± 2 K |
Ambient diffraction temperature | 296 ± 2 K |
Number of distinct elements | 5 |
Space group number | 14 |
Hermann-Mauguin space group symbol | P 1 21/c 1 |
Hall space group symbol | -P 2ybc |
Residual factor for all reflections | 0.0467 |
Residual factor for significantly intense reflections | 0.0319 |
Weighted residual factors for significantly intense reflections | 0.0655 |
Weighted residual factors for all reflections included in the refinement | 0.072 |
Goodness-of-fit parameter for all reflections included in the refinement | 1.03 |
Diffraction radiation wavelength | 0.71073 Å |
Diffraction radiation type | MoKα |