Information card for entry 4346038
Formula | C19 H6 O13 Re3 Sb |
Calculated formula | C19 H6 O13 Re3 Sb |
Title of publication | Host-guest behavior of a heavy-atom heterocycle Re4(CO)16(μ-SbPh2)2(μ-H)2 obtained from a palladium-assisted ring opening dimerization of Re2(CO)8(μ-SbPh2)(μ-H). |
Authors of publication | Adams, Richard D.; Pearl, Jr, William C; Wong, Yuen Onn; Hall, Michael B.; Walensky, Justin R. |
Journal of publication | Inorganic chemistry |
Year of publication | 2015 |
Journal volume | 54 |
Journal issue | 7 |
Pages of publication | 3536 - 3544 |
a | 10.3134 ± 0.0005 Å |
b | 14.3792 ± 0.0007 Å |
c | 18.3407 ± 0.0009 Å |
α | 90° |
β | 90.571 ± 0.001° |
γ | 90° |
Cell volume | 2719.8 ± 0.2 Å3 |
Cell temperature | 294 ± 2 K |
Ambient diffraction temperature | 294 ± 2 K |
Number of distinct elements | 5 |
Space group number | 11 |
Hermann-Mauguin space group symbol | P 1 21/m 1 |
Hall space group symbol | -P 2yb |
Residual factor for all reflections | 0.0536 |
Residual factor for significantly intense reflections | 0.04 |
Weighted residual factors for significantly intense reflections | 0.0933 |
Weighted residual factors for all reflections included in the refinement | 0.1069 |
Goodness-of-fit parameter for all reflections included in the refinement | 1.213 |
Diffraction radiation wavelength | 0.71073 Å |
Diffraction radiation type | MoKα |