Information card for entry 4346046
Common name | Zr6O4(OH)4(bpydc)5.88(CuCl)8.34 |
Formula | C70.56 H39.28 Cl8.34 Cu8.34 N11.76 O31.52 Zr6 |
Calculated formula | C70.56 H35.28 Cl8.34 Cu8.34 N11.76 O31.52 Zr6 |
Title of publication | Single-crystal-to-single-crystal metalation of a metal-organic framework: a route toward structurally well-defined catalysts. |
Authors of publication | Gonzalez, Miguel I.; Bloch, Eric D.; Mason, Jarad A.; Teat, Simon J.; Long, Jeffrey R. |
Journal of publication | Inorganic chemistry |
Year of publication | 2015 |
Journal volume | 54 |
Journal issue | 6 |
Pages of publication | 2995 - 3005 |
a | 26.149 ± 0.0008 Å |
b | 26.149 ± 0.0008 Å |
c | 26.149 ± 0.0008 Å |
α | 90° |
β | 90° |
γ | 90° |
Cell volume | 17879.9 ± 0.9 Å3 |
Cell temperature | 100 ± 2 K |
Ambient diffraction temperature | 100 ± 2 K |
Number of distinct elements | 7 |
Space group number | 205 |
Hermann-Mauguin space group symbol | P a -3 |
Hall space group symbol | -P 2ac 2ab 3 |
Residual factor for all reflections | 0.0761 |
Residual factor for significantly intense reflections | 0.0722 |
Weighted residual factors for significantly intense reflections | 0.2341 |
Weighted residual factors for all reflections included in the refinement | 0.2376 |
Goodness-of-fit parameter for all reflections included in the refinement | 1.248 |
Diffraction radiation wavelength | 0.7749 Å |
Diffraction radiation type | synchrotron |