Information card for entry 4346050
Common name | Zr6O4(OH)4(bpydc)5.34(CoCl2)4.56(CH3CN)1.22 |
Formula | C66.52 H39.7 Cl9.12 Co4.56 N11.9 O29.36 Zr6 |
Calculated formula | C66.52 H32.04 Cl9.12 Co4.56 N11.9 O29.36 Zr6 |
Title of publication | Single-crystal-to-single-crystal metalation of a metal-organic framework: a route toward structurally well-defined catalysts. |
Authors of publication | Gonzalez, Miguel I.; Bloch, Eric D.; Mason, Jarad A.; Teat, Simon J.; Long, Jeffrey R. |
Journal of publication | Inorganic chemistry |
Year of publication | 2015 |
Journal volume | 54 |
Journal issue | 6 |
Pages of publication | 2995 - 3005 |
a | 26.0729 ± 0.0006 Å |
b | 26.0729 ± 0.0006 Å |
c | 26.0729 ± 0.0006 Å |
α | 90° |
β | 90° |
γ | 90° |
Cell volume | 17724.3 ± 0.7 Å3 |
Cell temperature | 100 ± 2 K |
Ambient diffraction temperature | 100 ± 2 K |
Number of distinct elements | 7 |
Space group number | 205 |
Hermann-Mauguin space group symbol | P a -3 |
Hall space group symbol | -P 2ac 2ab 3 |
Residual factor for all reflections | 0.0664 |
Residual factor for significantly intense reflections | 0.0574 |
Weighted residual factors for significantly intense reflections | 0.1904 |
Weighted residual factors for all reflections included in the refinement | 0.2014 |
Goodness-of-fit parameter for all reflections included in the refinement | 1.097 |
Diffraction radiation wavelength | 0.7749 Å |
Diffraction radiation type | synchrotron |