Information card for entry 4346059
Formula | C164.25 H162.375 Ag B3 Mn2 N18.125 |
Calculated formula | C164.25 H162.375 Ag B3 Mn2 N18.125 |
Title of publication | Coordination-induced spin-state change in manganese(V) complexes: the electronic structure of manganese(V) nitrides. |
Authors of publication | Kropp, Henning; Scheurer, Andreas; Heinemann, Frank W.; Bendix, Jesper; Meyer, Karsten |
Journal of publication | Inorganic chemistry |
Year of publication | 2015 |
Journal volume | 54 |
Journal issue | 7 |
Pages of publication | 3562 - 3572 |
a | 56.793 ± 0.005 Å |
b | 15.1843 ± 0.0014 Å |
c | 40.541 ± 0.004 Å |
α | 90° |
β | 128.094 ± 0.001° |
γ | 90° |
Cell volume | 27514 ± 4 Å3 |
Cell temperature | 100 ± 2 K |
Ambient diffraction temperature | 100 ± 2 K |
Number of distinct elements | 6 |
Space group number | 15 |
Hermann-Mauguin space group symbol | C 1 2/c 1 |
Hall space group symbol | -C 2yc |
Residual factor for all reflections | 0.0691 |
Residual factor for significantly intense reflections | 0.0414 |
Weighted residual factors for significantly intense reflections | 0.0863 |
Weighted residual factors for all reflections included in the refinement | 0.0975 |
Goodness-of-fit parameter for all reflections included in the refinement | 1.016 |
Diffraction radiation wavelength | 0.71073 Å |
Diffraction radiation type | MoKα |