Information card for entry 4346063
Formula | C36 H24 Fe N10 |
Calculated formula | C36 H24 Fe N10 |
Title of publication | High-temperature spin crossover in two solvent-free coordination polymers with unusual high thermal stability. |
Authors of publication | Liu, Wei; Bao, Xin; Li, Jin-Yan; Qin, Yu-Lian; Chen, Yan-Cong; Ni, Zhao-Ping; Tong, Ming-Liang |
Journal of publication | Inorganic chemistry |
Year of publication | 2015 |
Journal volume | 54 |
Journal issue | 6 |
Pages of publication | 3006 - 3011 |
a | 8.8578 ± 0.0009 Å |
b | 8.6866 ± 0.0008 Å |
c | 19.5719 ± 0.0017 Å |
α | 90° |
β | 98.141 ± 0.003° |
γ | 90° |
Cell volume | 1490.8 ± 0.2 Å3 |
Cell temperature | 298 ± 2 K |
Ambient diffraction temperature | 298 ± 2 K |
Number of distinct elements | 4 |
Space group number | 14 |
Hermann-Mauguin space group symbol | P 1 21/c 1 |
Hall space group symbol | -P 2ybc |
Residual factor for all reflections | 0.089 |
Residual factor for significantly intense reflections | 0.0588 |
Weighted residual factors for significantly intense reflections | 0.1433 |
Weighted residual factors for all reflections included in the refinement | 0.1661 |
Goodness-of-fit parameter for all reflections included in the refinement | 1.088 |
Diffraction radiation wavelength | 0.71073 Å |
Diffraction radiation type | MoKα |