Information card for entry 4346065
Formula | C36 H24 Co N10 |
Calculated formula | C36 H24 Co N10 |
Title of publication | High-temperature spin crossover in two solvent-free coordination polymers with unusual high thermal stability. |
Authors of publication | Liu, Wei; Bao, Xin; Li, Jin-Yan; Qin, Yu-Lian; Chen, Yan-Cong; Ni, Zhao-Ping; Tong, Ming-Liang |
Journal of publication | Inorganic chemistry |
Year of publication | 2015 |
Journal volume | 54 |
Journal issue | 6 |
Pages of publication | 3006 - 3011 |
a | 8.6126 ± 0.0007 Å |
b | 8.9163 ± 0.0008 Å |
c | 20.0116 ± 0.0015 Å |
α | 90° |
β | 96.148 ± 0.002° |
γ | 90° |
Cell volume | 1527.9 ± 0.2 Å3 |
Cell temperature | 298 ± 2 K |
Ambient diffraction temperature | 298 ± 2 K |
Number of distinct elements | 4 |
Space group number | 14 |
Hermann-Mauguin space group symbol | P 1 21/c 1 |
Hall space group symbol | -P 2ybc |
Residual factor for all reflections | 0.1074 |
Residual factor for significantly intense reflections | 0.0489 |
Weighted residual factors for significantly intense reflections | 0.0962 |
Weighted residual factors for all reflections included in the refinement | 0.1199 |
Goodness-of-fit parameter for all reflections included in the refinement | 1.039 |
Diffraction radiation wavelength | 0.71073 Å |
Diffraction radiation type | MoKα |