Information card for entry 4346077
Formula | C128 H114 Cu6 F24 O6 P8 |
Calculated formula | C128 H114 Cu6 F24 O6 P8 |
Title of publication | Luminescence Solvato- and Vapochromism of Alkynyl-Phosphine Copper Clusters. |
Authors of publication | Krytchankou, Ilya S.; Koshevoy, Igor O.; Gurzhiy, Vladislav V.; Pomogaev, Vladimir A.; Tunik, Sergey P. |
Journal of publication | Inorganic chemistry |
Year of publication | 2015 |
Journal volume | 54 |
Journal issue | 17 |
Pages of publication | 8288 - 8297 |
a | 14.9882 ± 0.0012 Å |
b | 19.504 ± 0.0015 Å |
c | 22.5166 ± 0.0017 Å |
α | 90° |
β | 104.454 ± 0.002° |
γ | 90° |
Cell volume | 6373.9 ± 0.9 Å3 |
Cell temperature | 120 ± 2 K |
Ambient diffraction temperature | 120 ± 2 K |
Number of distinct elements | 6 |
Space group number | 14 |
Hermann-Mauguin space group symbol | P 1 21/n 1 |
Hall space group symbol | -P 2yn |
Residual factor for all reflections | 0.0617 |
Residual factor for significantly intense reflections | 0.0407 |
Weighted residual factors for significantly intense reflections | 0.0998 |
Weighted residual factors for all reflections included in the refinement | 0.113 |
Goodness-of-fit parameter for all reflections included in the refinement | 1.024 |
Diffraction radiation wavelength | 0.71073 Å |
Diffraction radiation type | MoKα |