Information card for entry 4346120
Formula | C12 H32 Br4 Cu4 S4 |
Calculated formula | C12 H32 Br4 Cu4 S4 |
Title of publication | Reactivity of CuI and CuBr toward dialkyl sulfides RSR: from discrete molecular Cu4I4S4 and Cu8I8S6 clusters to luminescent copper(I) coordination polymers. |
Authors of publication | Knorr, Michael; Bonnot, Antoine; Lapprand, Antony; Khatyr, Abderrahim; Strohmann, Carsten; Kubicki, Marek M.; Rousselin, Yoann; Harvey, Pierre D. |
Journal of publication | Inorganic chemistry |
Year of publication | 2015 |
Journal volume | 54 |
Journal issue | 8 |
Pages of publication | 4076 - 4093 |
a | 8.4255 ± 0.0003 Å |
b | 22.3179 ± 0.0006 Å |
c | 14.0836 ± 0.0005 Å |
α | 90 ± 0.005° |
β | 96.42 ± 0.001° |
γ | 90° |
Cell volume | 2631.67 ± 0.15 Å3 |
Cell temperature | 155 ± 2 K |
Ambient diffraction temperature | 155 ± 2 K |
Number of distinct elements | 5 |
Space group number | 14 |
Hermann-Mauguin space group symbol | P 1 21/c 1 |
Hall space group symbol | -P 2ybc |
Residual factor for all reflections | 0.0782 |
Residual factor for significantly intense reflections | 0.0555 |
Weighted residual factors for significantly intense reflections | 0.13 |
Weighted residual factors for all reflections included in the refinement | 0.1525 |
Goodness-of-fit parameter for all reflections included in the refinement | 1.153 |
Diffraction radiation wavelength | 0.71073 Å |
Diffraction radiation type | MoKα |