Information card for entry 4346145
Common name | in manuscript 5a |
Formula | C18 H37 Cl6 N2 P Ru Si |
Calculated formula | C18 H37 Cl6 N2 P Ru Si |
Title of publication | Bulky N-Phosphino-Functionalized N-Heterocyclic Carbene Ligands: Synthesis, Ruthenium Coordination Chemistry, and Ruthenium Alkylidene Complexes for Olefin Metathesis. |
Authors of publication | Brown, Christopher C.; Rominger, Frank; Limbach, Michael; Hofmann, Peter |
Journal of publication | Inorganic chemistry |
Year of publication | 2015 |
Journal volume | 54 |
Journal issue | 21 |
Pages of publication | 10126 - 10140 |
a | 9.8131 ± 0.0013 Å |
b | 15.449 ± 0.002 Å |
c | 19.426 ± 0.003 Å |
α | 90° |
β | 93.744 ± 0.003° |
γ | 90° |
Cell volume | 2938.7 ± 0.7 Å3 |
Cell temperature | 200 ± 2 K |
Ambient diffraction temperature | 200 ± 2 K |
Number of distinct elements | 7 |
Space group number | 14 |
Hermann-Mauguin space group symbol | P 1 21/n 1 |
Hall space group symbol | -P 2yn |
Residual factor for all reflections | 0.0982 |
Residual factor for significantly intense reflections | 0.0559 |
Weighted residual factors for significantly intense reflections | 0.109 |
Weighted residual factors for all reflections included in the refinement | 0.1241 |
Goodness-of-fit parameter for all reflections included in the refinement | 1.039 |
Diffraction radiation wavelength | 0.71073 Å |
Diffraction radiation type | MoKα |