Information card for entry 4346154
Formula | C29 H44 Cl2 N4 Zn |
Calculated formula | C29 H44 Cl2 N4 Zn |
SMILES | [Zn]12(Cl)(Cl)[N](=C(C)c3[n]1c(ccc3)C(=[N]2CCN(C(C)C)C(C)C)C)c1c(cccc1C(C)C)C(C)C |
Title of publication | Probing the Protonation State and the Redox-Active Sites of Pendant Base Iron(II) and Zinc(II) Pyridinediimine Complexes. |
Authors of publication | Delgado, Mayra; Sommer, Samantha K.; Swanson, Seth P.; Berger, Robert F.; Seda, Takele; Zakharov, Lev N.; Gilbertson, John D. |
Journal of publication | Inorganic chemistry |
Year of publication | 2015 |
Journal volume | 54 |
Journal issue | 15 |
Pages of publication | 7239 - 7248 |
a | 8.882 ± 0.003 Å |
b | 14.769 ± 0.006 Å |
c | 23.854 ± 0.009 Å |
α | 90° |
β | 90.435 ± 0.006° |
γ | 90° |
Cell volume | 3129 ± 2 Å3 |
Cell temperature | 173 ± 2 K |
Ambient diffraction temperature | 173 ± 2 K |
Number of distinct elements | 5 |
Space group number | 14 |
Hermann-Mauguin space group symbol | P 1 21/c 1 |
Hall space group symbol | -P 2ybc |
Residual factor for all reflections | 0.1372 |
Residual factor for significantly intense reflections | 0.0856 |
Weighted residual factors for significantly intense reflections | 0.1951 |
Weighted residual factors for all reflections included in the refinement | 0.23 |
Goodness-of-fit parameter for all reflections included in the refinement | 1.192 |
Diffraction radiation wavelength | 0.71073 Å |
Diffraction radiation type | MoKα |