Information card for entry 4346160
Common name | HOLNW02 |
Formula | C48 H63 Co N4 |
Calculated formula | C48 H63 Co N4 |
SMILES | [Co]1(N(C(=CC(=[N]1c1c(cccc1C(C)C)C(C)C)C(C)(C)C)C(C)(C)C)c1c(cccc1C(C)C)C(C)C)[N]#N=C(c1ccccc1)c1ccccc1 |
Title of publication | Cobalt(II) Complex of a Diazoalkane Radical Anion. |
Authors of publication | Bonyhady, Simon J.; Goldberg, Jonathan M.; Wedgwood, Nicole; Dugan, Thomas R.; Eklund, Andrew G.; Brennessel, William W.; Holland, Patrick L. |
Journal of publication | Inorganic chemistry |
Year of publication | 2015 |
Journal volume | 54 |
Journal issue | 11 |
Pages of publication | 5148 - 5150 |
a | 22.996 ± 0.003 Å |
b | 9.6235 ± 0.001 Å |
c | 20.482 ± 0.002 Å |
α | 90° |
β | 110.125 ± 0.002° |
γ | 90° |
Cell volume | 4256 ± 0.8 Å3 |
Cell temperature | 100 ± 0.1 K |
Ambient diffraction temperature | 100 ± 0.1 K |
Number of distinct elements | 4 |
Space group number | 14 |
Hermann-Mauguin space group symbol | P 1 21/c 1 |
Hall space group symbol | -P 2ybc |
Residual factor for all reflections | 0.1158 |
Residual factor for significantly intense reflections | 0.0614 |
Weighted residual factors for significantly intense reflections | 0.1308 |
Weighted residual factors for all reflections included in the refinement | 0.1562 |
Goodness-of-fit parameter for all reflections included in the refinement | 0.997 |
Diffraction radiation wavelength | 0.71073 Å |
Diffraction radiation type | MoKα |