Information card for entry 4346170
Formula | C24 H39 Cl F6 Fe N9 P |
Calculated formula | C24 H39 Cl F6 Fe N9 P |
Title of publication | Scan Rate Dependent Spin Crossover Iron(II) Complex with Two Different Relaxations and Thermal Hysteresis fac-[Fe(II)(HL(n-Pr))3]Cl·PF6 (HL(n-Pr) = 2-Methylimidazol-4-yl-methylideneamino-n-propyl). |
Authors of publication | Fujinami, Takeshi; Nishi, Koshiro; Hamada, Daisuke; Murakami, Keishiro; Matsumoto, Naohide; Iijima, Seiichiro; Kojima, Masaaki; Sunatsuki, Yukinari |
Journal of publication | Inorganic chemistry |
Year of publication | 2015 |
Journal volume | 54 |
Journal issue | 15 |
Pages of publication | 7291 - 7300 |
a | 10.4262 ± 0.001 Å |
b | 12.8104 ± 0.0011 Å |
c | 12.9668 ± 0.0012 Å |
α | 85.164 ± 0.002° |
β | 71.729 ± 0.003° |
γ | 80.404 ± 0.003° |
Cell volume | 1620.6 ± 0.3 Å3 |
Cell temperature | 143 K |
Ambient diffraction temperature | 130 K |
Number of distinct elements | 7 |
Space group number | 2 |
Hermann-Mauguin space group symbol | P -1 |
Hall space group symbol | -P 1 |
Residual factor for significantly intense reflections | 0.0773 |
Weighted residual factors for all reflections included in the refinement | 0.1748 |
Goodness-of-fit parameter for all reflections included in the refinement | 1.004 |
Diffraction radiation wavelength | 0.71075 Å |
Diffraction radiation type | MoKα |