Information card for entry 4346175
Formula | C39 H48 Co N2 O4 |
Calculated formula | C39 H48 Co N2 O4 |
Title of publication | Lattice-Modulated Phase Transition Coupled with Redox-Isomeric Interconversion of o-Semiquinone-Catecholato into Bis(o-semiquinonato) Cobalt Complexes. |
Authors of publication | Bubnov, Michael P.; Skorodumova, Nina A.; Arapova, Alla V.; Smirnova, Natalia N.; Samsonov, Maxim A.; Fukin, Georgy K.; Cherkasov, Vladimir K.; Abakumov, Gleb A. |
Journal of publication | Inorganic chemistry |
Year of publication | 2015 |
Journal volume | 54 |
Journal issue | 16 |
Pages of publication | 7767 - 7773 |
a | 10.7557 ± 0.0005 Å |
b | 31.4355 ± 0.001 Å |
c | 12.3761 ± 0.0007 Å |
α | 90° |
β | 115.365 ± 0.007° |
γ | 90° |
Cell volume | 3781.1 ± 0.4 Å3 |
Cell temperature | 375 ± 2 K |
Ambient diffraction temperature | 375 ± 2 K |
Number of distinct elements | 5 |
Space group number | 15 |
Hermann-Mauguin space group symbol | C 1 2/c 1 |
Hall space group symbol | -C 2yc |
Residual factor for all reflections | 0.1463 |
Residual factor for significantly intense reflections | 0.0721 |
Weighted residual factors for significantly intense reflections | 0.1892 |
Weighted residual factors for all reflections included in the refinement | 0.2214 |
Goodness-of-fit parameter for all reflections included in the refinement | 1.049 |
Diffraction radiation wavelength | 0.71073 Å |
Diffraction radiation type | MoKα |