Information card for entry 4346182
Common name | tetrakis(m-phenylenebis(dihexanoylmethanato))- (mu-bis(4-pyridyl)ethylene)bis(methanol)tetracopper chloroform solvate |
Formula | C152 H218 Cl30 Cu4 N2 O18 |
Calculated formula | C152 H218 Cl30 Cu4 N2 O18 |
Title of publication | Externally and Internally Functionalized Copper(II) β-Diketonate Molecular Squares. |
Authors of publication | Cherutoi, Jackson K.; Sandifer, Jace D.; Pokharel, Uttam R.; Fronczek, Frank R.; Pakhomova, Svetlana; Maverick, Andrew W. |
Journal of publication | Inorganic chemistry |
Year of publication | 2015 |
Journal volume | 54 |
Journal issue | 16 |
Pages of publication | 7791 - 7802 |
a | 15.0156 ± 0.0006 Å |
b | 18.8496 ± 0.0006 Å |
c | 19.2634 ± 0.0006 Å |
α | 64.513 ± 0.001° |
β | 86.865 ± 0.002° |
γ | 67.69 ± 0.002° |
Cell volume | 4514.5 ± 0.3 Å3 |
Cell temperature | 90 ± 0.5 K |
Ambient diffraction temperature | 90 ± 0.5 K |
Number of distinct elements | 6 |
Space group number | 2 |
Hermann-Mauguin space group symbol | P -1 |
Hall space group symbol | -P 1 |
Residual factor for all reflections | 0.0725 |
Residual factor for significantly intense reflections | 0.0664 |
Weighted residual factors for significantly intense reflections | 0.1717 |
Weighted residual factors for all reflections included in the refinement | 0.1774 |
Goodness-of-fit parameter for all reflections included in the refinement | 1.031 |
Diffraction radiation wavelength | 1.54184 Å |
Diffraction radiation type | CuKα |