Information card for entry 4346185
Common name | tetrakis(m-phenylenebis(dihexanoylmethanato))- (mu-C60fullerene)tetracopper o-dichlorobenzene solvate |
Formula | C212 H208 Cl8 Cu4 O16 |
Calculated formula | C212 H208 Cl8 Cu4 O16 |
Title of publication | Externally and Internally Functionalized Copper(II) β-Diketonate Molecular Squares. |
Authors of publication | Cherutoi, Jackson K.; Sandifer, Jace D.; Pokharel, Uttam R.; Fronczek, Frank R.; Pakhomova, Svetlana; Maverick, Andrew W. |
Journal of publication | Inorganic chemistry |
Year of publication | 2015 |
Journal volume | 54 |
Journal issue | 16 |
Pages of publication | 7791 - 7802 |
a | 15.8296 ± 0.0006 Å |
b | 17.7754 ± 0.0006 Å |
c | 17.9684 ± 0.0006 Å |
α | 75.077 ± 0.002° |
β | 67.686 ± 0.002° |
γ | 70.555 ± 0.002° |
Cell volume | 4360.4 ± 0.3 Å3 |
Cell temperature | 90 ± 2 K |
Ambient diffraction temperature | 90 ± 2 K |
Number of distinct elements | 5 |
Space group number | 2 |
Hermann-Mauguin space group symbol | P -1 |
Hall space group symbol | -P 1 |
Residual factor for all reflections | 0.0959 |
Residual factor for significantly intense reflections | 0.0881 |
Weighted residual factors for significantly intense reflections | 0.2374 |
Weighted residual factors for all reflections included in the refinement | 0.2456 |
Goodness-of-fit parameter for all reflections included in the refinement | 1.03 |
Diffraction radiation wavelength | 1.54184 Å |
Diffraction radiation type | CuKα |