Information card for entry 4346187
Formula | C67 H92 B2 Cl2 F4 N4 P2 Pt |
Calculated formula | C67 H92 B2 Cl2 F4 N4 P2 Pt |
SMILES | [Pt]([P](CCCC)(CCCC)CCCC)([P](CCCC)(CCCC)CCCC)(C#Cc1c(n2c(C(=c3[n](c(C)cc3C)[B]2(F)F)c2ccccc2)c1C)C)C#Cc1ccc(cc1)C1=c2[n](c(cc2C)C)[B](F)(F)n2c1c(C)cc2C.ClCCl |
Title of publication | Broad-Band N(∧)N Pt(II) Bisacetylide Visible Light Harvesting Complex with Heteroleptic Bodipy Acetylide Ligands. |
Authors of publication | Zhong, Fangfang; Karatay, Ahmet; Zhao, Liang; Zhao, Jianzhang; He, Cheng; Zhang, Caishun; Yaglioglu, Halime Gul; Elmali, Ayhan; Küçüköz, Betül; Hayvali, Mustafa |
Journal of publication | Inorganic chemistry |
Year of publication | 2015 |
Journal volume | 54 |
Journal issue | 16 |
Pages of publication | 7803 - 7817 |
a | 11.6142 ± 0.0003 Å |
b | 16.371 ± 0.0004 Å |
c | 18.6228 ± 0.0004 Å |
α | 106.362 ± 0.001° |
β | 91.066 ± 0.002° |
γ | 103.144 ± 0.002° |
Cell volume | 3295.48 ± 0.14 Å3 |
Cell temperature | 220 ± 2 K |
Ambient diffraction temperature | 220 ± 2 K |
Number of distinct elements | 8 |
Space group number | 2 |
Hermann-Mauguin space group symbol | P -1 |
Hall space group symbol | -P 1 |
Residual factor for all reflections | 0.0431 |
Residual factor for significantly intense reflections | 0.0374 |
Weighted residual factors for significantly intense reflections | 0.086 |
Weighted residual factors for all reflections included in the refinement | 0.0884 |
Goodness-of-fit parameter for all reflections included in the refinement | 1.059 |
Diffraction radiation wavelength | 0.71073 Å |
Diffraction radiation type | MoKα |