Information card for entry 4346192
Formula | C35 H24 Cl4 N6 Pt2 S2 |
Calculated formula | C35 H24 Cl4 N6 Pt2 S2 |
SMILES | [Pt]123([Pt]4(Cl)(Sc5[n]2cccn5)([n]2cccc5ccc6cccc4c6c25)[n]2c(S1)nccc2)(Cl)[n]1cccc2ccc4cccc3c4c12.ClCCl |
Title of publication | Oxidation of Half-Lantern Pt2(II,II) Compounds by Halocarbons. Evidence of Dioxygen Insertion into a Pt(III)-CH3 Bond. |
Authors of publication | Sicilia, V.; Baya, M.; Borja, P.; Martín, A |
Journal of publication | Inorganic chemistry |
Year of publication | 2015 |
Journal volume | 54 |
Journal issue | 15 |
Pages of publication | 7316 - 7324 |
a | 17.2231 ± 0.0004 Å |
b | 14.571 ± 0.0002 Å |
c | 27.9052 ± 0.0006 Å |
α | 90° |
β | 90° |
γ | 90° |
Cell volume | 7003 ± 0.2 Å3 |
Cell temperature | 100 ± 2 K |
Ambient diffraction temperature | 100 ± 2 K |
Number of distinct elements | 6 |
Space group number | 61 |
Hermann-Mauguin space group symbol | P b c a |
Hall space group symbol | -P 2ac 2ab |
Residual factor for all reflections | 0.0317 |
Residual factor for significantly intense reflections | 0.0201 |
Weighted residual factors for significantly intense reflections | 0.0369 |
Weighted residual factors for all reflections included in the refinement | 0.0377 |
Goodness-of-fit parameter for all reflections included in the refinement | 1.008 |
Diffraction radiation wavelength | 0.71073 Å |
Diffraction radiation type | MoKα |