Information card for entry 4346196
Formula | C28 H24.65 Cl2 Co N4 O3.33 |
Calculated formula | C28 H24.648 Cl2 Co N4 O3.324 |
Title of publication | Light-Driven Proton Reduction in Aqueous Medium Catalyzed by a Family of Cobalt Complexes with Tetradentate Polypyridine-Type Ligands. |
Authors of publication | Tong, Lianpeng; Kopecky, Andrew; Zong, Ruifa; Gagnon, Kevin J.; Ahlquist, Mårten S G; Thummel, Randolph P. |
Journal of publication | Inorganic chemistry |
Year of publication | 2015 |
Journal volume | 54 |
Journal issue | 16 |
Pages of publication | 7873 - 7884 |
a | 7.0062 ± 0.0002 Å |
b | 13.4709 ± 0.0005 Å |
c | 13.8003 ± 0.0005 Å |
α | 106.528 ± 0.002° |
β | 91.222 ± 0.002° |
γ | 92.264 ± 0.002° |
Cell volume | 1246.96 ± 0.08 Å3 |
Cell temperature | 100 ± 2 K |
Ambient diffraction temperature | 100 ± 2 K |
Number of distinct elements | 6 |
Space group number | 2 |
Hermann-Mauguin space group symbol | P -1 |
Hall space group symbol | -P 1 |
Residual factor for all reflections | 0.0494 |
Residual factor for significantly intense reflections | 0.0343 |
Weighted residual factors for significantly intense reflections | 0.0766 |
Weighted residual factors for all reflections included in the refinement | 0.0831 |
Goodness-of-fit parameter for all reflections included in the refinement | 1.025 |
Diffraction radiation wavelength | 0.7749 Å |
Diffraction radiation type | synchrotron |