Information card for entry 4346223
Chemical name | poly[di-μ-oxido-μ- [4-[3'-(tetrazol-5-yl)phenyl]-4H-1,2,4-triazole- κ^4^N1:N2]-diaqua-tetraoxodimolybdenum(VI)] |
Formula | C9 H11 Mo2 N7 O8 |
Calculated formula | C9 H11 Mo2 N7 O8 |
Title of publication | Synthesis and Structural Elucidation of Triazolylmolybdenum(VI) Oxide Hybrids and Their Behavior as Oxidation Catalysts. |
Authors of publication | Lysenko, Andrey B.; Senchyk, Ganna A.; Domasevitch, Konstantin V.; Hauser, Jürg; Fuhrmann, Daniel; Kobalz, Merten; Krautscheid, Harald; Neves, Patrícia; Valente, Anabela A.; Gonçalves, Isabel S |
Journal of publication | Inorganic chemistry |
Year of publication | 2015 |
Journal volume | 54 |
Journal issue | 17 |
Pages of publication | 8327 - 8338 |
a | 7.5725 ± 0.0002 Å |
b | 22.13 ± 0.0003 Å |
c | 9.426 ± 0.0002 Å |
α | 90° |
β | 98.541 ± 0.002° |
γ | 90° |
Cell volume | 1562.09 ± 0.06 Å3 |
Cell temperature | 296 ± 2 K |
Ambient diffraction temperature | 296 ± 2 K |
Number of distinct elements | 5 |
Space group number | 14 |
Hermann-Mauguin space group symbol | P 1 21/n 1 |
Hall space group symbol | -P 2yn |
Residual factor for all reflections | 0.025 |
Residual factor for significantly intense reflections | 0.0223 |
Weighted residual factors for significantly intense reflections | 0.0497 |
Weighted residual factors for all reflections included in the refinement | 0.0508 |
Goodness-of-fit parameter for all reflections included in the refinement | 1.143 |
Diffraction radiation wavelength | 0.71073 Å |
Diffraction radiation type | MoKα |