Information card for entry 4346225
Chemical name | poly[di-μ-oxido-μ~4~-[1,4-bis-(1,2,4-triazol-4-yl)benzene- κ^4^N1:N2:N1':N2']-tetraoxodimolybdenum(VI)] Monohydrate |
Formula | C10 H10 Mo2 N6 O7 |
Calculated formula | C10 H8 Mo2 N6 O7 |
Title of publication | Synthesis and Structural Elucidation of Triazolylmolybdenum(VI) Oxide Hybrids and Their Behavior as Oxidation Catalysts. |
Authors of publication | Lysenko, Andrey B.; Senchyk, Ganna A.; Domasevitch, Konstantin V.; Hauser, Jürg; Fuhrmann, Daniel; Kobalz, Merten; Krautscheid, Harald; Neves, Patrícia; Valente, Anabela A.; Gonçalves, Isabel S |
Journal of publication | Inorganic chemistry |
Year of publication | 2015 |
Journal volume | 54 |
Journal issue | 17 |
Pages of publication | 8327 - 8338 |
a | 13.3074 ± 0.0009 Å |
b | 11.6037 ± 0.001 Å |
c | 18.8502 ± 0.0013 Å |
α | 90° |
β | 90° |
γ | 90° |
Cell volume | 2910.8 ± 0.4 Å3 |
Cell temperature | 173 ± 2 K |
Ambient diffraction temperature | 173 ± 2 K |
Number of distinct elements | 5 |
Space group number | 61 |
Hermann-Mauguin space group symbol | P b c a |
Hall space group symbol | -P 2ac 2ab |
Residual factor for all reflections | 0.0361 |
Residual factor for significantly intense reflections | 0.0235 |
Weighted residual factors for significantly intense reflections | 0.05 |
Weighted residual factors for all reflections included in the refinement | 0.0522 |
Goodness-of-fit parameter for all reflections included in the refinement | 0.956 |
Diffraction radiation wavelength | 0.71073 Å |
Diffraction radiation type | MoKα |