Information card for entry 4346248
Formula | C37 H51 Au B Cl3 N P |
Calculated formula | C37 H51 Au B Cl3 N P |
SMILES | [Au]([P](N(c1c(C(C)C)cccc1C(C)C)B(C1CCCCC1)C1CCCCC1)(c1ccccc1)c1ccccc1)Cl.ClCCl |
Title of publication | Synthesis, Characterization, and Luminescence Studies of Gold(I) Complexes with PNP- and PNB-Based Ligand Systems. |
Authors of publication | Pal, Shiv; Kathewad, Neha; Pant, Rakesh; Khan, Shabana |
Journal of publication | Inorganic chemistry |
Year of publication | 2015 |
Journal volume | 54 |
Journal issue | 21 |
Pages of publication | 10172 - 10183 |
a | 10.208 ± 0.003 Å |
b | 10.213 ± 0.003 Å |
c | 19.148 ± 0.005 Å |
α | 78.516 ± 0.006° |
β | 79.126 ± 0.006° |
γ | 79.207 ± 0.006° |
Cell volume | 1897.8 ± 0.9 Å3 |
Cell temperature | 100 ± 2 K |
Ambient diffraction temperature | 100 ± 2 K |
Number of distinct elements | 7 |
Space group number | 2 |
Hermann-Mauguin space group symbol | P -1 |
Hall space group symbol | -P 1 |
Residual factor for all reflections | 0.0361 |
Residual factor for significantly intense reflections | 0.0295 |
Weighted residual factors for significantly intense reflections | 0.0577 |
Weighted residual factors for all reflections included in the refinement | 0.0597 |
Goodness-of-fit parameter for all reflections included in the refinement | 1.048 |
Diffraction radiation wavelength | 0.71073 Å |
Diffraction radiation type | MoKα |