Information card for entry 4346251
Formula | C44 H82 Cl Li N2 O6 P2 W |
Calculated formula | C44 H82 Cl Li N2 O6 P2 W |
SMILES | [W]1(Cl)(=P[P]1(C(C)(C)C)C(C)(C)C)(=Nc1c(cccc1C(C)C)C(C)C)=Nc1c(cccc1C(C)C)C(C)C.[O]1(C)CC[O](C)[Li]231([O](C)CC[O]2C)[O](C)CC[O]3C |
Title of publication | Reactivity of Phosphanylphosphinidene Complex of Tungsten(VI) toward Phosphines: A New Method of Synthesis of catena-Polyphosphorus Ligands. |
Authors of publication | Grubba, Rafał; Ordyszewska, Anna; Kaniewska, Kinga; Ponikiewski, Łukasz; Chojnacki, Jarosław; Gudat, Dietrich; Pikies, Jerzy |
Journal of publication | Inorganic chemistry |
Year of publication | 2015 |
Journal volume | 54 |
Journal issue | 17 |
Pages of publication | 8380 - 8387 |
a | 12.6393 ± 0.0004 Å |
b | 12.7411 ± 0.0004 Å |
c | 17.416 ± 0.0005 Å |
α | 84.087 ± 0.003° |
β | 87.718 ± 0.003° |
γ | 84.3 ± 0.003° |
Cell volume | 2774.69 ± 0.15 Å3 |
Cell temperature | 120 ± 2 K |
Ambient diffraction temperature | 120 ± 2 K |
Number of distinct elements | 8 |
Space group number | 2 |
Hermann-Mauguin space group symbol | P -1 |
Hall space group symbol | -P 1 |
Residual factor for all reflections | 0.049 |
Residual factor for significantly intense reflections | 0.043 |
Weighted residual factors for significantly intense reflections | 0.0988 |
Weighted residual factors for all reflections included in the refinement | 0.1041 |
Goodness-of-fit parameter for all reflections included in the refinement | 1.052 |
Diffraction radiation wavelength | 0.71073 Å |
Diffraction radiation type | MoKα |