Information card for entry 4346294
Formula | C35 H40 Fe N3 O4 |
Calculated formula | C35 H40 Fe N3 O4 |
Title of publication | Experimental and Theoretical Investigations of Magnetic Exchange Pathways in Structurally Diverse Iron(III) Schiff-Base Complexes. |
Authors of publication | Herchel, Radovan; Nemec, Ivan; Machata, Marek; Trávníček, Zdeněk |
Journal of publication | Inorganic chemistry |
Year of publication | 2015 |
Journal volume | 54 |
Journal issue | 17 |
Pages of publication | 8625 - 8638 |
a | 9.2609 ± 0.0003 Å |
b | 25.8855 ± 0.001 Å |
c | 12.941 ± 0.0005 Å |
α | 90° |
β | 92.822 ± 0.003° |
γ | 90° |
Cell volume | 3098.5 ± 0.2 Å3 |
Cell temperature | 150 ± 2 K |
Ambient diffraction temperature | 150 ± 2 K |
Number of distinct elements | 5 |
Space group number | 14 |
Hermann-Mauguin space group symbol | P 1 21/c 1 |
Hall space group symbol | -P 2ybc |
Residual factor for all reflections | 0.0739 |
Residual factor for significantly intense reflections | 0.0471 |
Weighted residual factors for significantly intense reflections | 0.1162 |
Weighted residual factors for all reflections included in the refinement | 0.1221 |
Goodness-of-fit parameter for all reflections included in the refinement | 1.043 |
Diffraction radiation wavelength | 0.71073 Å |
Diffraction radiation type | MoKα |