Information card for entry 4346298
Common name | trans-I-(RSRS)-(1-(2,4-dinitrophenyl)-1,4,8,11-tetra-azacyclotetradecane) -copper(ii) diperchlorate |
Formula | C16 H26 Cl2 Cu N6 O12 |
Calculated formula | C16 H26 Cl2 Cu N6 O12 |
SMILES | [Cu]1234[N]5(CCC[NH]1CC[NH]2CCC[NH]3CC5)c1c(cc(cc1)N(=O)=O)N(=[O]4)=O.Cl(=O)(=O)(=O)[O-].Cl(=O)(=O)(=O)[O-] |
Title of publication | Copper(II) Complexes of Cyclams Containing Nitrophenyl Substituents: Push-Pull Behavior and Scorpionate Coordination of the Nitro Group. |
Authors of publication | Boiocchi, Massimo; Ciarrocchi, Carlo; Fabbrizzi, Luigi; Licchelli, Maurizio; Mangano, Carlo; Poggi, Antonio; Vázquez López, Miguel |
Journal of publication | Inorganic chemistry |
Year of publication | 2015 |
Journal volume | 54 |
Journal issue | 21 |
Pages of publication | 10197 - 10207 |
a | 10.8503 ± 0.0018 Å |
b | 13.51 ± 0.003 Å |
c | 16.975 ± 0.008 Å |
α | 90° |
β | 94.969 ± 0.012° |
γ | 90° |
Cell volume | 2479 ± 1.4 Å3 |
Cell temperature | 293 ± 2 K |
Ambient diffraction temperature | 293 ± 2 K |
Number of distinct elements | 6 |
Space group number | 14 |
Hermann-Mauguin space group symbol | P 1 21/c 1 |
Hall space group symbol | -P 2ybc |
Residual factor for all reflections | 0.1083 |
Residual factor for significantly intense reflections | 0.0754 |
Weighted residual factors for significantly intense reflections | 0.1605 |
Weighted residual factors for all reflections included in the refinement | 0.1898 |
Goodness-of-fit parameter for all reflections included in the refinement | 1.119 |
Diffraction radiation wavelength | 0.71073 Å |
Diffraction radiation type | MoKα |