Information card for entry 4346320
Formula | C49 H72 B4 Cl4 O7 Ru7 |
Calculated formula | C49 H72 B4 Cl4 O7 Ru7 |
Title of publication | Homometallic Cubane Clusters: Participation of Three-Coordinated Hydrogen in 60-Valence Electron Cubane Core. |
Authors of publication | Yuvaraj, K.; Roy, Dipak Kumar; Mondal, Bijan; Varghese, Babu; Ghosh, Sundargopal |
Journal of publication | Inorganic chemistry |
Year of publication | 2015 |
Journal volume | 54 |
Journal issue | 17 |
Pages of publication | 8673 - 8678 |
a | 18.4692 ± 0.0004 Å |
b | 15.5254 ± 0.0004 Å |
c | 43.1308 ± 0.001 Å |
α | 90° |
β | 96.599 ± 0.002° |
γ | 90° |
Cell volume | 12285.5 ± 0.5 Å3 |
Cell temperature | 293 ± 2 K |
Ambient diffraction temperature | 293 ± 2 K |
Number of distinct elements | 6 |
Space group number | 15 |
Hermann-Mauguin space group symbol | C 1 2/c 1 |
Hall space group symbol | -C 2yc |
Residual factor for all reflections | 0.0524 |
Residual factor for significantly intense reflections | 0.0325 |
Weighted residual factors for significantly intense reflections | 0.0665 |
Weighted residual factors for all reflections included in the refinement | 0.0792 |
Goodness-of-fit parameter for all reflections included in the refinement | 0.978 |
Diffraction radiation wavelength | 0.71073 Å |
Diffraction radiation type | MoKα |