Information card for entry 4346323
Formula | C120 H152 Cl8 N6 O38 P8 Zn8 |
Calculated formula | C120 H152 Cl8 N6 O38 P8 Zn8 |
SMILES | c1(c(cc(cc1C(C)C)Cl)C(C)C)OP12=[O][Zn]3(OP4(Oc5c(cc(cc5C(C)C)Cl)C(C)C)=[O][Zn](O1)(OP1(Oc5c(cc(cc5C(C)C)Cl)C(C)C)=[O][Zn](OP5(Oc6c(cc(cc6C(C)C)Cl)C(C)C)=[O][Zn]6(OP7(Oc8c(cc(cc8C(C)C)Cl)C(C)C)=[O][Zn]8(OP(Oc9c(cc(cc9C(C)C)Cl)C(C)C)(O6)=[O][Zn]([N]#CC)(O5)OP(Oc5c(cc(cc5C(C)C)Cl)C(C)C)(O8)=[O][Zn](O7)(OP(Oc5c(cc(cc5C(C)C)Cl)C(C)C)(O3)=[O][Zn]([N]#CC)(O4)O1)[OH2])[O]=c1[nH]cccc1)[O]=c1[nH]cccc1)(O2)[OH2])[O]=c1[nH]cccc1)[O]=c1[nH]cccc1 |
Title of publication | Octanuclear zinc phosphates with hitherto unknown cluster architectures: ancillary ligand and solvent assisted structural transformations thereof. |
Authors of publication | Dar, Aijaz A.; Sen, Saumik; Gupta, Sandeep K.; Patwari, G. Naresh; Murugavel, Ramaswamy |
Journal of publication | Inorganic chemistry |
Year of publication | 2015 |
Journal volume | 54 |
Journal issue | 19 |
Pages of publication | 9458 - 9469 |
a | 43.5493 ± 0.0011 Å |
b | 43.5493 ± 0.0011 Å |
c | 16.3262 ± 0.0007 Å |
α | 90° |
β | 90° |
γ | 90° |
Cell volume | 30963.3 ± 1.7 Å3 |
Cell temperature | 150 ± 2 K |
Ambient diffraction temperature | 150 ± 2 K |
Number of distinct elements | 7 |
Space group number | 88 |
Hermann-Mauguin space group symbol | I 41/a :2 |
Hall space group symbol | -I 4ad |
Residual factor for all reflections | 0.0787 |
Residual factor for significantly intense reflections | 0.0665 |
Weighted residual factors for significantly intense reflections | 0.169 |
Weighted residual factors for all reflections included in the refinement | 0.18 |
Goodness-of-fit parameter for all reflections included in the refinement | 1.036 |
Diffraction radiation wavelength | 0.71075 Å |
Diffraction radiation type | MoKα |