Information card for entry 4346337
Formula | C19 H21 Cu N16 O6 |
Calculated formula | C19 H21 Cu N16 O6 |
Title of publication | Independent Control of Optical and Explosive Properties: Pyrazole-Tetrazine Complexes of First Row Transition Metals. |
Authors of publication | Myers, Thomas W.; Chavez, David E.; Hanson, Susan K.; Scharff, R. Jason; Scott, Brian L.; Veauthier, Jacqueline M.; Wu, Ruilian |
Journal of publication | Inorganic chemistry |
Year of publication | 2015 |
Journal volume | 54 |
Journal issue | 16 |
Pages of publication | 8077 - 8086 |
a | 13.422 ± 0.002 Å |
b | 14.769 ± 0.002 Å |
c | 13.618 ± 0.002 Å |
α | 90° |
β | 101.544 ± 0.002° |
γ | 90° |
Cell volume | 2644.9 ± 0.7 Å3 |
Cell temperature | 100 ± 2 K |
Ambient diffraction temperature | 100 ± 2 K |
Number of distinct elements | 5 |
Space group number | 14 |
Hermann-Mauguin space group symbol | P 1 21/n 1 |
Hall space group symbol | -P 2yn |
Residual factor for all reflections | 0.0506 |
Residual factor for significantly intense reflections | 0.0467 |
Weighted residual factors for significantly intense reflections | 0.149 |
Weighted residual factors for all reflections included in the refinement | 0.1524 |
Goodness-of-fit parameter for all reflections included in the refinement | 1.044 |
Diffraction radiation wavelength | 0.71073 Å |
Diffraction radiation type | MoKα |