Information card for entry 4346346
Formula | C52 H40 Dy0.24 N24 O18 Y3.76 |
Calculated formula | C52 H40 Dy0.24 N24 O18 Y3.76 |
Title of publication | Single-Molecule-Magnet Behavior in a [2 ×2] Grid Dy(III)4 Cluster and a Dysprosium-Doped Y(III)4 Cluster. |
Authors of publication | Guo, Peng-Hu; Liu, Jiang; Wu, Zi-Hao; Yan, Hua; Chen, Yan-Cong; Jia, Jian-Hua; Tong, Ming-Liang |
Journal of publication | Inorganic chemistry |
Year of publication | 2015 |
Journal volume | 54 |
Journal issue | 16 |
Pages of publication | 8087 - 8092 |
a | 12.1909 ± 0.0005 Å |
b | 16.8969 ± 0.0008 Å |
c | 15.4868 ± 0.0006 Å |
α | 90° |
β | 92.091 ± 0.001° |
γ | 90° |
Cell volume | 3188 ± 0.2 Å3 |
Cell temperature | 293 ± 2 K |
Ambient diffraction temperature | 293 ± 2 K |
Number of distinct elements | 6 |
Space group number | 14 |
Hermann-Mauguin space group symbol | P 1 21/n 1 |
Hall space group symbol | -P 2yn |
Residual factor for all reflections | 0.0699 |
Residual factor for significantly intense reflections | 0.0394 |
Weighted residual factors for significantly intense reflections | 0.0804 |
Weighted residual factors for all reflections included in the refinement | 0.0949 |
Goodness-of-fit parameter for all reflections included in the refinement | 1.012 |
Diffraction radiation wavelength | 0.71073 Å |
Diffraction radiation type | MoKα |