Information card for entry 4346350
Formula | C40 H33 Ag3 I6 N8 Ni |
Calculated formula | C40 H33 Ag3 I6 N8 Ni |
Title of publication | Two Types of 2D Layered Iodoargentates Based on Trimeric [Ag3I7] Secondary Building Units and Hexameric [Ag6I12] Ternary Building Units: Syntheses, Crystal Structures, and Efficient Visible Light Responding Photocatalytic Properties. |
Authors of publication | Lei, Xiao-Wu; Yue, Cheng-Yang; Zhao, Jian-Qiang; Han, Yong-Fang; Yang, Jiang-Tao; Meng, Rong-Rong; Gao, Chuan-Sheng; Ding, Hao; Wang, Chun-Yan; Chen, Wan-Dong; Hong, Mao-Chun |
Journal of publication | Inorganic chemistry |
Year of publication | 2015 |
Journal volume | 54 |
Journal issue | 22 |
Pages of publication | 10593 - 10603 |
a | 22.6467 ± 0.001 Å |
b | 13.5115 ± 0.0006 Å |
c | 16.215 ± 0.0007 Å |
α | 90° |
β | 107.93° |
γ | 90° |
Cell volume | 4720.7 ± 0.4 Å3 |
Cell temperature | 296 ± 2 K |
Ambient diffraction temperature | 296 ± 2 K |
Number of distinct elements | 6 |
Space group number | 5 |
Hermann-Mauguin space group symbol | C 1 2 1 |
Hall space group symbol | C 2y |
Residual factor for all reflections | 0.0247 |
Residual factor for significantly intense reflections | 0.0224 |
Weighted residual factors for significantly intense reflections | 0.0472 |
Weighted residual factors for all reflections included in the refinement | 0.0479 |
Goodness-of-fit parameter for all reflections included in the refinement | 1.01 |
Diffraction radiation wavelength | 0.71073 Å |
Diffraction radiation type | MoKα |