Information card for entry 4346353
Formula | C60 H48 Ag6 Fe2 I11 K0.93 N12 |
Calculated formula | C60 H48 Ag6 Fe2 I11 K0.932 N12 |
Title of publication | Two Types of 2D Layered Iodoargentates Based on Trimeric [Ag3I7] Secondary Building Units and Hexameric [Ag6I12] Ternary Building Units: Syntheses, Crystal Structures, and Efficient Visible Light Responding Photocatalytic Properties. |
Authors of publication | Lei, Xiao-Wu; Yue, Cheng-Yang; Zhao, Jian-Qiang; Han, Yong-Fang; Yang, Jiang-Tao; Meng, Rong-Rong; Gao, Chuan-Sheng; Ding, Hao; Wang, Chun-Yan; Chen, Wan-Dong; Hong, Mao-Chun |
Journal of publication | Inorganic chemistry |
Year of publication | 2015 |
Journal volume | 54 |
Journal issue | 22 |
Pages of publication | 10593 - 10603 |
a | 14.5723 ± 0.0013 Å |
b | 14.5723 ± 0.0013 Å |
c | 31.178 ± 0.003 Å |
α | 90° |
β | 90° |
γ | 120° |
Cell volume | 5733.7 ± 0.9 Å3 |
Cell temperature | 296 ± 2 K |
Ambient diffraction temperature | 296 ± 2 K |
Number of distinct elements | 7 |
Space group number | 148 |
Hermann-Mauguin space group symbol | R -3 :H |
Hall space group symbol | -R 3 |
Residual factor for all reflections | 0.0308 |
Residual factor for significantly intense reflections | 0.0266 |
Weighted residual factors for significantly intense reflections | 0.0485 |
Weighted residual factors for all reflections included in the refinement | 0.05 |
Goodness-of-fit parameter for all reflections included in the refinement | 1.033 |
Diffraction radiation wavelength | 0.71073 Å |
Diffraction radiation type | MoKα |