Information card for entry 4346358
Formula | C24 H24 Cu6 I8 N2 |
Calculated formula | C24 H24 Cu6 I8 N2 |
Title of publication | Symmetrically Related Construction and Optical Properties of Two Noncentrosymmetric 3D Iodides of d(10) Cation (Cu(+), Ag(+)) Based on the N-Benzylpyridinium and Its Supramolecular Interactions. |
Authors of publication | Qiao, Yanrong; Hao, Pengfei; Fu, Yunlong |
Journal of publication | Inorganic chemistry |
Year of publication | 2015 |
Journal volume | 54 |
Journal issue | 17 |
Pages of publication | 8705 - 8710 |
a | 14.4193 ± 0.0007 Å |
b | 14.783 ± 0.0007 Å |
c | 17.2685 ± 0.0009 Å |
α | 90° |
β | 90° |
γ | 90° |
Cell volume | 3681 ± 0.3 Å3 |
Cell temperature | 293 ± 2 K |
Ambient diffraction temperature | 293 ± 2 K |
Number of distinct elements | 5 |
Space group number | 19 |
Hermann-Mauguin space group symbol | P 21 21 21 |
Hall space group symbol | P 2ac 2ab |
Residual factor for all reflections | 0.0477 |
Residual factor for significantly intense reflections | 0.0415 |
Weighted residual factors for significantly intense reflections | 0.0769 |
Weighted residual factors for all reflections included in the refinement | 0.0816 |
Goodness-of-fit parameter for all reflections included in the refinement | 1.001 |
Diffraction radiation wavelength | 0.71073 Å |
Diffraction radiation type | MoKα |