Information card for entry 4346360
Formula | C48 H108 O P6 Se12 U2 |
Calculated formula | C48 H108 O P6 Se12 U2 |
SMILES | C(C)(C)(C)P1(C(C)(C)C)=[Se][U]23([Se]=P(C(C)(C)C)(C(C)(C)C)[Se]2)([Se]=P(C(C)(C)C)(C(C)(C)C)[Se]3)(O[U]234([Se]=P(C(C)(C)C)(C(C)(C)C)[Se]2)([Se]=P(C(C)(C)C)(C(C)(C)C)[Se]3)[Se]=P(C(C)(C)C)(C(C)(C)C)[Se]4)[Se]1 |
Title of publication | Dithio- and Diselenophosphinate Thorium(IV) and Uranium(IV) Complexes: Molecular and Electronic Structures, Spectroscopy, and Transmetalation Reactivity. |
Authors of publication | Behrle, Andrew C.; Kerridge, Andrew; Walensky, Justin R. |
Journal of publication | Inorganic chemistry |
Year of publication | 2015 |
Journal volume | 54 |
Journal issue | 24 |
Pages of publication | 11625 - 11636 |
a | 12.5023 ± 0.0003 Å |
b | 12.3547 ± 0.0003 Å |
c | 24.0321 ± 0.0006 Å |
α | 90° |
β | 90.761 ± 0.001° |
γ | 90° |
Cell volume | 3711.72 ± 0.16 Å3 |
Cell temperature | 95 ± 2 K |
Ambient diffraction temperature | 95 ± 2 K |
Number of distinct elements | 6 |
Space group number | 14 |
Hermann-Mauguin space group symbol | P 1 21/n 1 |
Hall space group symbol | -P 2yn |
Residual factor for all reflections | 0.0211 |
Residual factor for significantly intense reflections | 0.0211 |
Weighted residual factors for significantly intense reflections | 0.0592 |
Weighted residual factors for all reflections included in the refinement | 0.0592 |
Goodness-of-fit parameter for all reflections included in the refinement | 1.293 |
Diffraction radiation wavelength | 1.54178 Å |
Diffraction radiation type | CuKα |