Information card for entry 4346364
Formula | C32 H72 P4 S8 Th |
Calculated formula | C32 H72 P4 S8 Th |
SMILES | C(C)(C)(P1(C(C)(C)C)=[S][Th]234(S1)([S]=P(S2)(C(C)(C)C)C(C)(C)C)([S]=P(C(C)(C)C)(C(C)(C)C)S3)[S]=P(C(C)(C)C)(S4)C(C)(C)C)C |
Title of publication | Dithio- and Diselenophosphinate Thorium(IV) and Uranium(IV) Complexes: Molecular and Electronic Structures, Spectroscopy, and Transmetalation Reactivity. |
Authors of publication | Behrle, Andrew C.; Kerridge, Andrew; Walensky, Justin R. |
Journal of publication | Inorganic chemistry |
Year of publication | 2015 |
Journal volume | 54 |
Journal issue | 24 |
Pages of publication | 11625 - 11636 |
a | 18.09 ± 0.015 Å |
b | 18.09 ± 0.015 Å |
c | 15.871 ± 0.013 Å |
α | 90° |
β | 90° |
γ | 90° |
Cell volume | 5194 ± 7 Å3 |
Cell temperature | 100 ± 2 K |
Ambient diffraction temperature | 100 ± 2 K |
Number of distinct elements | 5 |
Space group number | 118 |
Hermann-Mauguin space group symbol | P -4 n 2 |
Hall space group symbol | P -4 -2n |
Residual factor for all reflections | 0.0158 |
Residual factor for significantly intense reflections | 0.0139 |
Weighted residual factors for significantly intense reflections | 0.0315 |
Weighted residual factors for all reflections included in the refinement | 0.0321 |
Goodness-of-fit parameter for all reflections included in the refinement | 0.962 |
Diffraction radiation wavelength | 0.71073 Å |
Diffraction radiation type | MoKα |