Information card for entry 4346388
Formula | C39 H42 B F20 P6 Re |
Calculated formula | C39 H42 B F20 P6 Re |
Title of publication | Homoleptic Tris-Diphosphine Re(I) and Re(II) Complexes and Re(II) Photophysics and Photochemistry. |
Authors of publication | Adams, Jeramie J.; Arulsamy, Navamoney; Sullivan, B. Patrick; Roddick, Dean M.; Neuberger, Amelia; Schmehl, Russell H. |
Journal of publication | Inorganic chemistry |
Year of publication | 2015 |
Journal volume | 54 |
Journal issue | 23 |
Pages of publication | 11136 - 11149 |
a | 13.4704 ± 0.0001 Å |
b | 14.8232 ± 0.0003 Å |
c | 14.9949 ± 0.0002 Å |
α | 103.416 ± 0.001° |
β | 116.598 ± 0.001° |
γ | 105.723 ± 0.001° |
Cell volume | 2349.88 ± 0.07 Å3 |
Cell temperature | 150 ± 2 K |
Ambient diffraction temperature | 150 ± 2 K |
Number of distinct elements | 6 |
Space group number | 2 |
Hermann-Mauguin space group symbol | P -1 |
Hall space group symbol | -P 1 |
Residual factor for all reflections | 0.0383 |
Residual factor for significantly intense reflections | 0.0325 |
Weighted residual factors for significantly intense reflections | 0.0793 |
Weighted residual factors for all reflections included in the refinement | 0.0831 |
Goodness-of-fit parameter for all reflections included in the refinement | 1.053 |
Diffraction radiation wavelength | 0.71073 Å |
Diffraction radiation type | MoKα |