Information card for entry 4346390
Formula | C45 H54 B F20 P6 Re |
Calculated formula | C45 H49.3333 B F20 P6 Re |
SMILES | [Re]123([P](C)(C)CCC[P]1(C)C)([P](C)(C)CCC[P]2(C)C)[P](C)(C)CCC[P]3(C)C.[B-](c1c(F)c(F)c(F)c(F)c1F)(c1c(F)c(F)c(F)c(F)c1F)(c1c(F)c(F)c(F)c(F)c1F)c1c(F)c(F)c(F)c(F)c1F |
Title of publication | Homoleptic Tris-Diphosphine Re(I) and Re(II) Complexes and Re(II) Photophysics and Photochemistry. |
Authors of publication | Adams, Jeramie J.; Arulsamy, Navamoney; Sullivan, B. Patrick; Roddick, Dean M.; Neuberger, Amelia; Schmehl, Russell H. |
Journal of publication | Inorganic chemistry |
Year of publication | 2015 |
Journal volume | 54 |
Journal issue | 23 |
Pages of publication | 11136 - 11149 |
a | 17.294 ± 0.0002 Å |
b | 17.6696 ± 0.0003 Å |
c | 27.3846 ± 0.0004 Å |
α | 72.514 ± 0.001° |
β | 78.494 ± 0.001° |
γ | 77.689 ± 0.001° |
Cell volume | 7715.1 ± 0.2 Å3 |
Cell temperature | 150 ± 2 K |
Ambient diffraction temperature | 150 ± 2 K |
Number of distinct elements | 6 |
Space group number | 2 |
Hermann-Mauguin space group symbol | P -1 |
Hall space group symbol | -P 1 |
Residual factor for all reflections | 0.129 |
Residual factor for significantly intense reflections | 0.0829 |
Weighted residual factors for significantly intense reflections | 0.2221 |
Weighted residual factors for all reflections included in the refinement | 0.2561 |
Goodness-of-fit parameter for all reflections included in the refinement | 1.047 |
Diffraction radiation wavelength | 0.71073 Å |
Diffraction radiation type | MoKα |