Information card for entry 4346398
Formula | C54 H87 Cl N4 P2 |
Calculated formula | C54 H87 Cl N4 P2 |
SMILES | P1([C](P([C]1c1c(C(C)(C)C)cc(cc1C(C)(C)C)C(C)(C)C)C(C)(C)C)c1c(C(C)(C)C)cc(cc1C(C)(C)C)C(C)(C)C)c1nc(nc(N(CC)CC)c1Cl)N(CC)CC |
Title of publication | Chemical Detection of Hydrogen Fluoride by the Phosphorus Congener of Cyclobutane-1,3-diyl. |
Authors of publication | Ueta, Yasuhiro; Mikami, Koichi; Ito, Shigekazu |
Journal of publication | Inorganic chemistry |
Year of publication | 2015 |
Journal volume | 54 |
Journal issue | 17 |
Pages of publication | 8778 - 8785 |
a | 9.4898 ± 0.0006 Å |
b | 10.8011 ± 0.0005 Å |
c | 26.3998 ± 0.0012 Å |
α | 97.538 ± 0.001° |
β | 98.853 ± 0.002° |
γ | 95.676 ± 0.002° |
Cell volume | 2631 ± 0.2 Å3 |
Cell temperature | 123 ± 2 K |
Ambient diffraction temperature | 123 ± 2 K |
Number of distinct elements | 5 |
Space group number | 2 |
Hermann-Mauguin space group symbol | P -1 |
Hall space group symbol | -P 1 |
Residual factor for all reflections | 0.1736 |
Residual factor for significantly intense reflections | 0.0954 |
Weighted residual factors for significantly intense reflections | 0.2373 |
Weighted residual factors for all reflections included in the refinement | 0.3213 |
Goodness-of-fit parameter for all reflections included in the refinement | 1.734 |
Diffraction radiation wavelength | 0.71075 Å |
Diffraction radiation type | MoKα |