Information card for entry 4346400
Formula | C52 H24 F26 Gd2 N4 O10 |
Calculated formula | C52 H24 F26 Gd2 N4 O10 |
Title of publication | Ligand Field Affected Single-Molecule Magnet Behavior of Lanthanide(III) Dinuclear Complexes with an 8-Hydroxyquinoline Schiff Base Derivative as Bridging Ligand. |
Authors of publication | Wang, Wen-Min; Zhang, Hong-Xia; Wang, Shi-Yu; Shen, Hai-Yun; Gao, Hong-Ling; Cui, Jian-Zhong; Zhao, Bin |
Journal of publication | Inorganic chemistry |
Year of publication | 2015 |
Journal volume | 54 |
Journal issue | 22 |
Pages of publication | 10610 - 10622 |
a | 11.207 ± 0.002 Å |
b | 19.142 ± 0.004 Å |
c | 13.093 ± 0.003 Å |
α | 90° |
β | 94.83 ± 0.03° |
γ | 90° |
Cell volume | 2798.8 ± 1 Å3 |
Cell temperature | 113 ± 2 K |
Ambient diffraction temperature | 113 ± 2 K |
Number of distinct elements | 6 |
Space group number | 14 |
Hermann-Mauguin space group symbol | P 1 21/n 1 |
Hall space group symbol | -P 2yn |
Residual factor for all reflections | 0.0317 |
Residual factor for significantly intense reflections | 0.0255 |
Weighted residual factors for significantly intense reflections | 0.0543 |
Weighted residual factors for all reflections included in the refinement | 0.0568 |
Goodness-of-fit parameter for all reflections included in the refinement | 1.005 |
Diffraction radiation wavelength | 0.71073 Å |
Diffraction radiation type | MoKα |